*HEADING
cubit(abaqus_facet.inp): 12/16/2013: 10:42:27
version: 13.1
**
********************************** P A R T S **********************************
*PART, NAME=Part-Default
**
********************************** N O D E S **********************************
*NODE, NSET=ALLNODES
**
********************************** E L E M E N T S ****************************
*ELEMENT, TYPE=C3D4, ELSET=EB4
**
********************************** N O D E S E T S **********************************
*NSET, NSET=NS4
*NSET, NSET=NS5
*NSET, NSET=NS6
**
********************************** S I D E S E T S **********************************
*ELSET, ELSET=OutflowLeft_S1
*ELSET, ELSET=OutflowLeft_S4
*SURFACE, NAME=OutflowLeft
OutflowLeft_S1, S1
OutflowLeft_S4, S4
*ELSET, ELSET=Inflow_S1
*ELSET, ELSET=Inflow_S3
*SURFACE, NAME=Inflow
Inflow_S1, S1
Inflow_S3, S3
*ELSET, ELSET=OutflowRigt_S1
*ELSET, ELSET=OutflowRigt_S2
*ELSET, ELSET=OutflowRigt_S4
*SURFACE, NAME=OutflowRigt
OutflowRigt_S1, S1
OutflowRigt_S2, S2
OutflowRigt_S4, S4
*ELSET, ELSET=RightArm_S1
*ELSET, ELSET=RightArm_S2
*ELSET, ELSET=RightArm_S3
*ELSET, ELSET=RightArm_S4
*SURFACE, NAME=RightArm
RightArm_S1, S1
RightArm_S2, S2
RightArm_S3, S3
RightArm_S4, S4
*ELSET, ELSET=BottomArm_S1
*ELSET, ELSET=BottomArm_S2
*ELSET, ELSET=BottomArm_S3
*ELSET, ELSET=BottomArm_S4
*SURFACE, NAME=BottomArm
BottomArm_S1, S1
BottomArm_S2, S2
BottomArm_S3, S3
BottomArm_S4, S4
*ELSET, ELSET=LeftArm_S1
*ELSET, ELSET=LeftArm_S2
*ELSET, ELSET=LeftArm_S3
*ELSET, ELSET=LeftArm_S4
*SURFACE, NAME=LeftArm
LeftArm_S1, S1
LeftArm_S2, S2
LeftArm_S3, S3
LeftArm_S4, S4
*ELSET, ELSET=Ball_S1
*ELSET, ELSET=Ball_S2
*ELSET, ELSET=Ball_S4
*SURFACE, NAME=Ball
Ball_S1, S1
Ball_S2, S2
Ball_S4, S4
**
********************************** P R O P E R T I E S ************************
*SOLID SECTION, ELSET=EB4, MATERIAL=Default-Steel
**
*END PART
**
**
**
********************************** E N D   P A R T S **********************************
**
**
********************************** A S S E M B L Y ************************************
**
*ASSEMBLY, NAME=ASSEMBLY1
**
*INSTANCE, NAME=Part-Default_1, PART=Part-Default
*END INSTANCE
**
*END ASSEMBLY
**
**
**
*MATERIAL, NAME = Default-Steel
*ELASTIC, TYPE=ISOTROPIC
2.068000e+05, 2.900000e-01
*DENSITY
7.000000e-06
*CONDUCTIVITY,TYPE=ISO
4.500000e-02
*SPECIFIC HEAT
5.000000e+02
**
**
************************************** H I S T O R Y *************************************
**
*PREPRINT
**
**************************************** S T E P 1 ***************************************
*STEP,INC=100,NAME=Default Set
**
*STATIC
1, 1, 1e-05, 1
**
**
**
*END STEP